specimen ID, field of view 1,Unnamed: 2,field of view 2,Unnamed: 4,field of view 3,Unnamed: 6,field of view 4,Unnamed: 8,field of view 5,Unnamed: 10,total,Unnamed: 12,study enrolement
,tubules,glomeruli,tubules,glomeruli,tubules,glomeruli,tubules,glomeruli,tubules,glomeruli,tubules,glomeruli,[I = inclusion; E = exclusion]
A-1,3,1,3,1,2,/,3,1,2,/,2 to 3,1,I
A-2,3,2,3,2,2,/,3,2,2,/,2 to 3,2,E
A-3,2,0,2,0,2,0,2,/,2,/,2,0,I
A-4,3,1,1,/,3,1,2,1,3,1,2,1,I
A-5,3,1,3,1,2,/,3,1,2,0,2 to 3,1,I
A-6,2,2,1,/,2,1,1,/,3,1,1 to 2,1,I
A-7,2,1,2,0,1,/,1,0,2,/,1 to 2,0 to 1,I
A-8,2,0,2,/,2,1,3,1,2,/,2,1,I
A-9,1,0,1,/,2,0,3,1,2,1,2,0 to 1,I
A-10,2,1,1,0,1,/,2,2,1,0,1 to 2,1,I
A-11,3,2,2,/,3,2,3,2,2,/,2 to 3,2,E
A-12,3,2,3,/,3,2,3,/,3,2,3,2,E
A-13,2,1,3,2,3,2,2,/,3,1,2 to 3,1 to 2,I
A-14,3,1,3,2,2,/,3,1,3,2,3,1 to 2,I
A-15,3,2,3,2,3,2,3,1,2,/,2 to 3,1 to 2,I
A-16,3,2,3,2,3,2,3,2,3,/,3,2,I
A-17,1,/,3,2,3,2,2,/,3,1,2 to 3,2,I
A-18,2,0,2,0,1,0,2,0,2,1,1 to 2,0,I
A-19,2,/,2,1,2,0,2,1,2,1,2,1,I
A-20,3,2,2,/,3,2,3,2,3,2,2 to 3,2,E
A-21,2,0,2,1,3,1,3,/,2,/,2 to 3,1,I
A-22,1,/,2,/,3,1,3,1,3,1,2 to 3,1,E
A-23,2,1,2,/,2,1,3,1,2,1,2,1,I
A-24,2,1,2,1,1,/,3,2,2,2,2,1 to 2,I
A-25,3,2,2,/,3,2,2,/,3,2,2 to 3,2,I
A-26,3,2,3,2,3,2,3,2,3,2,3,2,E
A-27,3,1,2,0,3,0,2,/,2,0,2 to 3,0 to 1,I
A-28,,,,,,,,,,,spleen,,E
A-29,,,,,,,,,,,spleen,,E
A-30,3,2,3,2,2,/,2,/,3,1,3,2,E
A-31,2,1,2,/,3,2,3,1,3,1,2 to 3,1,I
A-32,3,1,3,1,2,/,3,2,3,2,3,1 to 2,E
A-33,3,0,3,1,3,1,2,/,2,1,2 to 3,1,I
A-34,3,/,3,2,3,/,3,2,3,2,3,2,E
A-35,3,2,2,/,3,2,1,/,3,2,2 to 3,2,I
A-36,3,1,3,/,2,/,3,1,3,1,3,1,I
,,,,,,,,,,,,,
ER-1,,,,,,,,,,,2,1,I
ER-2,,,,,,,,,,,2 to 3,0 to 1,I
ER-3,,,,,,,,,,,2 to 3,1,I
ER-4,,,,,,,,,,,2,0,I
ER-5,,,,,,,,,,,1 to 2,0,I
ER-6,,,,,,,,,,,2 to 3,1,I
ER-7,,,,,,,,,,,3,1,I
ER-8,,,,,,,,,,,2,1,I
ER-9,,,,,,,,,,,2 to 3,0 to 1,I
ER-10,,,,,,,,,,,2 to 3,0,I
ER-11,,,,,,,,,,,3,0 to 1,I
ER-12,,,,,,,,,,,2 to 3,0 to 1,I
ER-13,,,,,,,,,,,2 to 3,0 to 1,I
ER-14,,,,,,,,,,,3,1,E
,,,,,,,,,,,,,
Ctrl-1,2,1,2,0,2,/,3,0,2,/,2,0,I
Ctrl-2,3,1,2,/,3,1,1,/,3,1,2 to 3,1,I
Ctrl-3,3,1,3,1,3,2,2,/,3,/,3,1 to 2,I
Ctrl-4,3,2,3,2,3,/,3,/,3,2,3,2,E
Ctrl-5,2,0,2,0,1,/,1,0,1,/,1,0,I
Ctrl-6,2,/,3,0,3,1,2,/,3,1,3,0 to 1,I
Ctrl-7,2,0,1,/,2,1,1,/,2,1,1 to 2,1,I
Ctrl-8,3,1,3,1,2,/,3,1,2,/,2 to 3,1,I
Ctrl-9,3,2,2,/,3,1,2,/,3,2,3,1 to 2,E
Ctrl-10,2,/,3,0,2,/,3,0,3,0,2 to 3,0,I
Ctrl-11,3,2,3,/,3,2,3,/,3,2,3,2,E
